{"text_format":"1","workbook":"xlsx","n_sheets":8,"sheets":["Instruction","SUMMARY","User Inputs","Base Stock","CountryData","Database","Policy Scenarios","Inputs & References"],"not_rendered":{"charts":4,"images":28,"macros":1,"external_links":1,"defined_names":121,"comments":4,"pivot_tables":0},"unopened":[],"bounds":{"document_bytes":16777216,"sheet_cells":100000,"rows_first":2000,"rows_last":500,"rows_between":2000,"halvings":0,"cell_chars":16384,"cell_head_chars":4096},"cells_cut":0,"cells_raw":0,"read":"whole","date_system":"1900"}

{"sheet":"Instruction","index":0,"n_rows":43,"n_cols":4,"rows_kept":43,"cut":false,"hidden":false,"merged":[[2,1,2,2]]}
["POLICY ANALYSIS MODEL for ASEAN (PAMA)"]
[]
[null,"Cell Color Definitions"]
[]
[null,null,"Inputs available for User Modification","These are data for which an estimate has been given, but which can be replaced if better information is available"]
[null,null,"Do Not Modify","These Values are necessary calculations or parameters which should not be edited"]
[]
[null,null,"Worksheets"]
{"$rows_left_out":36}
{"sheet":"SUMMARY","index":1,"n_rows":67,"n_cols":14,"rows_kept":67,"cut":false,"hidden":false,"merged":[[3,1,3,2],[5,1,5,2],[9,1,9,2],[7,1,7,2],[72,8,72,10],[4,8,4,9],[5,8,5,9],[6,8,6,10],[7,8,7,10],[3,8,3,13],[4,5,4,7],[73,8,74,10],[8,2,8,3],[8,8,8,10],[71,8,71,10],[66,1,66,13]]}
[null,null,{"$f":"VLOOKUP(CountryIndex,CountryData!$A$201:$D$210,4,FALSE)","v":"Malaysia"}]
[]
[null,null,null,null,null,null,{"$f":"VLOOKUP(CountryIndex,CountryData!$A$201:$B$210,2,FALSE)","v":"CountryData!C205"}]
[null," Country",null,null,null,null,null,null,"COUNTRY PROFILE, AT A GLANCE"]
[null,null,null,null,null,"Custom GDP growth",null,null,"    Population (2015)",null,null,null,{"$f":"ROUND(VALUE(OFFSET(TopPop,CountryIndex-1,1)/1000),2)&\" million\"","v":"30.33 million"}]
[null," Economic Growth",null,null,null,"User input",null,null,"    GDP per capita PPP (2013)",null,null,null,{"$f":"VALUE(OFFSET(TopPercapIncome,CountryIndex-1,0))&\" US$\"","v":"22530 US$"}]
[null,null,null,null,null,null,null,null,"    Electricity use/Electrification (2015)",null,null,null,{"$f":"ROUNDDOWN(VALUE(OFFSET(TopElecUse,CountryIndex-1,1)),1)&\" TWh /\"","v":"148.8 TWh /"},{"$f":"VALUE(OFFSET(TopElecRate,CountryIndex-1,0))","v":0.995}]
[null," Analysis Year",null,null,null,null,null,null,"    Transmission & Distribution loss",null,null,null,{"$f":"VALUE(OFFSET(TopTD,CountryIndex-1,0))","v":6.4001844876623873E-2}]
{"$rows_left_out":60}
{"sheet":"User Inputs","index":2,"n_rows":315,"n_cols":14,"rows_kept":315,"cut":false,"hidden":false,"merged":[[48,5,48,6],[5,5,5,11],[7,13,18,13],[3,1,3,3],[33,5,33,6]]}
[]
[null,"User Inputs"]
[]
[null,"Shipments Data",null,null,null,"Energy data"]
[]
[null,"Year","Sales (units)","Default (units)",null,"Sectoral Electricity Consumption (%)"]
[null,2030,null,{"$f":"'Base Stock'!G8","v":51671261.634258032}]
[null,2029,null,{"$f":"'Base Stock'!G9","v":50910527.20885139},null,"Country Name","Residential","Commercial","Industrial","Public","Others","Entry Check",null,"Note: By default, the model has used official electricity statistics in each country for the period 2014-15 as indicated in the grey field.\nBy updating this data, users MUST not leave any of the 5 sectors blank. It is required to enter 0% in case of no data. The automatic entry for \"Others\" will ensure that the summation of the total consumption is equal to 100%, providing an error notification if sum is greater than 100%."]
{"$rows_left_out":308}
{"sheet":"Base Stock","index":3,"n_rows":88,"n_cols":38,"rows_kept":88,"cut":false,"hidden":false,"merged":[]}
[null,"Stock and Shipments Forecast in the Base Case"]
[null,null,null,null,null,null,null,"Cumulative Retirement Function"]
[null,"Age_0",null,null,{"$f":"VALUE(OFFSET(TopLifetime,CountryIndex-1,2))","v":5.7410098505241258},null,null,0,{"$f":"1/(1+EXP(-(I7-Age_0)/DeltaAge))","v":0.18394973945144757},0.23584898818240427,0.29706070243387472,0.36653880091541202,0.44204794354854571,0.52033502205288595,0.59763598330633172,0.67037117973916072,0.73577123697664504,0.79221742642726234,0.83923989076136718,0.87726946395608463,0.90729646763436345,0.93055863479334144,0.94831612283034661,0.96171948168844557,0.97175044643948483,0.9792097358538272,0.9847303510568105,0.98880179485911512,0.99179668722295422,0.99399547758796025,0.99560752119267393,0.99678817534341946,0.99765222987341451,0.99828423402430777,0.99874632064043067,0.99908407320674786,0.99933089313562196,0.99951123365286954]
[null,"DeltaAge",null,null,{"$f":"VALUE(OFFSET(TopLifetime,CountryIndex-1,3))","v":3.1822843777907521},null,null,"Annual Retirement Function"]
[null,"Ship_Adj",null,null,5,null,null,0,{"$f":"(I3-H3)/(1-H3)","v":0.18394973945144757},{"$f":"(J3-I3)/(1-I3)","v":6.3598103254166968E-2},{"$f":"(K3-J3)/(1-J3)","v":8.0104211477615386E-2},{"$f":"(L3-K3)/(1-K3)","v":9.8839400104817038E-2},0.11920089619103999,0.14031147945262887,0.16115615024528362,0.18076963499498136,0.19840515518555829,0.21362621088162181,0.2263061022181625,0.2365610061776347,0.24465796896327882,0.25093075274875765,0.25571916658260696,0.2593334632017284,0.26203837339400798,0.26404981580906595,0.26553848302112953,0.26663637241775279,0.26744396322091685,0.26803688031481737,0.26847157760313217,0.26878994812140145,0.26902294564080081,0.26919336937489058,0.26931797382010286,0.26940905083833533,0.26947560732198372,0.2695242372310907]
[null,null,null,null,null,null,null,null,"Vintage"]
[null,"Year","Total Stock","Ideal Stock","First Purchase","Replacements","Total Sales","Regulated Sales",1,{"$f":"+I7+1","v":2},3,4,5,6,7,8,9,10,11,12,13,14,15,16,17,18,19,20,21,22,23,24,25,26,27,28,29,30]
[null,2030,{"$f":"SUM(Database!B123:E123)","v":448180596.85173237},{"$f":"SUM(I8:AL8)","v":323077894.30353677},{"$f":"IF(UserIncomeGrowth>0,E9*(1+UserIncomeGrowth),(1+VLOOKUP((VALUE(OFFSET(TopSRESref,CountryIndex-1,0))),SRESEcoGrowth,EcoIndex+1,FALSE))*E9)","v":23713685.575647578},{"$f":"SUMPRODUCT(I$5:AB$5,I8:AB8)*(0.97^(2031-$B$24))","v":27575919.364751529},{"$f":"IF(VLOOKUP($B8,UserShipments,2,FALSE)>0,VLOOKUP($B8,UserShipments,2,FALSE),(E8+F9))","v":51671261.634258032},{"$f":"G8*IF(NewOnly>0,NewOnly,1)","v":51671261.634258032},{"$f":"+G9*(1-H$5)","v":50910527.20885139},{"$f":"+I9*(1-I$5)","v":40953167.911345929},{"$f":"+J9*(1-J$5)","v":37813541.79247126},{"$f":"+K9*(1-K$5)","v":34303307.429009393},{"$f":"+L9*(1-L$5)","v":30482012.363747571},26465082.203072555,22412509.833901118,18504190.950167321,{"$f":"+P9*(1-P$5)","v":14902043.368770771},11730816.027201671,9041404.9043019861,6865177.9554022513,5117625.6302745212,3858556.3430490009,2813490.5569835468,2065953.6740442482,1462873.8390950696,1029873.3622718485,720986.13548775995,502398.69134185929,352040.73115265614,245875.50049046538,171177.94786644107,118788.58254926885,82155.566733364874,56615.435884885839,38862.131674939003,26559.800201829956,18062.940154520726,12215.486037379489]
{"$rows_left_out":81}
{"sheet":"CountryData","index":4,"n_rows":210,"n_cols":67,"rows_kept":210,"cut":false,"hidden":false,"merged":[[17,40,17,57],[19,36,19,39],[17,5,17,15],[17,17,17,25],[17,26,17,34],[17,36,18,36],[17,37,18,37]]}
[]
[null,null,"Sources:"]
[null,null,"Population: Population Division of the Department of Economic and Social Affairs of the United Nations Secretariat, 2015 and National census"]
[null,null,"Electrification Rates: Most recent data from respective organisations in each ASEAN member state",null,null,null,null,null,null,null,null,null,null,null,null,null,null,null,null,"SRES Scenarios Income growth"]
[null,null,"Household Size: UN Habitat and most recent country census report (2010-12)",null,null,null,null,null,null,null,null,null,null,null,null,null,null,null,null,"Country","High growth (OECD)","Conservative (ADB)","Custom growth (user input)"]
[null,null,"Urbanization: UN Escap",null,null,null,null,null,null,null,null,null,null,null,null,null,null,null,{"$f":"U5","v":"High growth (OECD)"},1,1.7999999999999999E-2,1.2E-2,{"$f":"IF(AND(UserGDPgrowth<>0,EcoIndex=3,CountryIndex=1),UserGDPgrowth,U6)","v":1.7999999999999999E-2}]
[null,null,"Income PPP: World Bank",null,null,null,null,null,null,null,null,null,null,null,null,null,null,null,{"$f":"V5","v":"Conservative (ADB)"},2,7.2999999999999995E-2,0.04,{"$f":"IF(AND(UserGDPgrowth<>0,EcoIndex=3,CountryIndex=2),UserGDPgrowth,U7)","v":7.2999999999999995E-2}]
[null,null,"Generation Mix: IEA, Heat Rate are assumed to be 3.3 for thermal generation and 3.13 for Nuclear (IEA average gross heat rate)",null,null,null,null,null,null,null,null,null,null,null,null,null,null,null,{"$f":"W5","v":"Custom growth (user input)"},3,5.5E-2,2.5000000000000001E-2,{"$f":"IF(AND(UserGDPgrowth<>0,EcoIndex=3,CountryIndex=3),UserGDPgrowth,U8)","v":5.5E-2}]
{"$rows_left_out":203}
{"sheet":"Database","index":5,"n_rows":215,"n_cols":64,"rows_kept":215,"cut":false,"hidden":false,"merged":[[205,2,205,5],[0,18,0,30],[4,0,13,0],[1,0,1,6],[1,18,1,31],[104,2,104,5],[86,13,86,14],[85,13,85,14],[1,8,1,11],[0,37,0,44],[1,42,1,43],[3,32,3,34],[104,0,105,1],[106,0,115,0],[25,17,34,17],[23,19,23,29],[23,17,24,18],[3,22,3,31],[3,18,3,21]]}
[null,"OFFICIAL DATA OR DATA FROM PRELIMINARY ANALYSIS",null,null,null,null,null,null,null,null,null,null,null,null,null,null,null,null,"Assumptions and Econometric modelling",null,null,null,null,null,null,null,null,null,null,null,null,null,null,null,null,null,null,"Time series SHIPMENT projection"]
["Sectoral Electricity Consumption (data in 2014-15)",null,null,null,null,null,null,null,"Share of electricity use for lighting",null,null,null,null,null,null,null,null,null,"Assumption on Typical wattage & Operating hours",null,null,null,null,null,null,null,null,null,null,null,null,null,null,null,null,null,null,"Historial shipment (Sales)",null,null,null,null,"Lamps lifetime",null,null,"% Share of installed lamps in each sector in the selected country"]
[]
[null,"Country","Residential","Commercial","Industrial","Public","Others",null,"Elec. use for lighting\n(commercial sector)","Elec. use for lighting\n(industrial sector)","% Elec. Use for street lighting","No. of light points per HH",null,null,null,null,null,null,"Typical wattage",null,null,null,"Operating hours (default vaule by country)",null,null,null,null,null,null,null,null,null,"Utilisation\n(%)",null,null,null,null,"Country","Est. sales in 2014 (units)","Est. sales in 2012 (units)","Est. sales in 2010 (units)",null,"Lamp type","AVG lifespan (hours)",null,"Country","Residential","Professional","Street lighting","Total stock"]
["SEA","Brunei Darussalam",{"$f":"IF(VLOOKUP($B5,'User Inputs'!$F$9:$K$27,2,FALSE)>0,VLOOKUP(Database!$B5,'User Inputs'!$F$9:$K$27,2,FALSE),38%)","v":0.38},{"$f":"IF(VLOOKUP($B5,'User Inputs'!$F$9:$K$27,3,FALSE)>0,VLOOKUP(Database!$B5,'User Inputs'!$F$9:$K$27,3,FALSE),15%)","v":0.15},{"$f":"IF(VLOOKUP($B5,'User Inputs'!$F$9:$K$27,4,FALSE)>0,VLOOKUP(Database!$B5,'User Inputs'!$F$9:$K$27,4,FALSE),18%)","v":0.18},{"$f":"IF(VLOOKUP($B5,'User Inputs'!$F$9:$K$27,5,FALSE)>0,VLOOKUP(Database!$B5,'User Inputs'!$F$9:$K$27,5,FALSE),29%)","v":0.28999999999999998},{"$f":"1-SUM(C5:F5)","v":0},null,{"$f":"IF(AND(UserComeleclighting>0,CountryIndex=1),UserComeleclighting,14%)","v":0.14000000000000001},{"$f":"IF(AND(UserIndeleclighting>0,CountryIndex=1),UserIndeleclighting,AVERAGE($J$11,$J$13,$J$14))","v":4.5400000000000003E-2},{"$f":"IF(AND(UserStreetconsumption>0,CountryIndex=1),UserStreetconsumption,AVERAGE($K$6:$K$9,$K$12:$K$14))","v":1.0451428571428572E-2},{"$f":"IF(AND(UserLightpoint>0,CountryIndex=1),UserLightpoint,23)","v":23},null,null,null,null,null,null,"Lamp type","Commercial (W)","Industrial (W)","Outdoor (W)","BRN","KHM","IDN","LAO","MAS","MYM","PHP","SGP","THA","VNM","Commercial","Industrial","Outdoor",null,null,"Brunei Darussalam",702284.3444872665,659397.31464234914,613690.38366559148,null,"Incandescent",900,null,{"$f":"OFFSET(TopCountry,CountryIndex-1,0)","v":"Malaysia"},{"$f":"B138","v":146776180.62760937},{"$f":"SUM(C138+D138)","v":118019784.19340181},{"$f":"E138","v":2724059.2914005611},{"$f":"SUM(AU5:AW5)","v":267520024.11241174}]
[null,"Cambodia",{"$f":"IF(VLOOKUP($B6,'User Inputs'!$F$9:$K$27,2,FALSE)>0,VLOOKUP(Database!$B6,'User Inputs'!$F$9:$K$27,2,FALSE),26%)","v":0.26},{"$f":"IF(VLOOKUP($B6,'User Inputs'!$F$9:$K$27,3,FALSE)>0,VLOOKUP(Database!$B6,'User Inputs'!$F$9:$K$27,3,FALSE),28%)","v":0.28000000000000003},{"$f":"IF(VLOOKUP($B6,'User Inputs'!$F$9:$K$27,4,FALSE)>0,VLOOKUP(Database!$B6,'User Inputs'!$F$9:$K$27,4,FALSE),20%)","v":0.2},{"$f":"IF(VLOOKUP($B6,'User Inputs'!$F$9:$K$27,5,FALSE)>0,VLOOKUP(Database!$B6,'User Inputs'!$F$9:$K$27,5,FALSE),4%)","v":0.04},{"$f":"1-SUM(C6:F6)","v":0.21999999999999997},null,{"$f":"IF(AND(UserComeleclighting>0,CountryIndex=2),UserComeleclighting,AVERAGE($I$5,$I$7,$I$9,$I$11:$I$14))","v":0.14618571428571428},{"$f":"IF(AND(UserIndeleclighting>0,CountryIndex=2),UserIndeleclighting,AVERAGE($J$11,$J$13,$J$14))","v":4.5400000000000003E-2},{"$f":"IF(AND(UserStreetconsumption>0,CountryIndex=2),UserStreetconsumption,2%)","v":0.02},{"$f":"IF(AND(UserLightpoint>0,CountryIndex=2),UserLightpoint,8.07)","v":8.07},null,null,null,null,null,null,"Incandescent",60,60,100,6.5,7.1,7.1,7.1,7.1,7.1,7.1,6.5,7.1,7.1,{"$f":"250/365*97%","v":0.66438356164383561},{"$f":"340/365*90%","v":0.83835616438356164},1,null,null,"Cambodia",4449692.8965279385,3931748.6433720863,3474093.1012835754,null,"Halogen",1000,null,"Percentage share",{"$f":"AU5/$AX$5","v":0.54865493196103376},{"$f":"AV5/$AX$5","v":0.44116243105529168},{"$f":"AW5/$AX$5","v":1.0182636983674588E-2}]
[null,"Indonesia",{"$f":"IF(VLOOKUP($B7,'User Inputs'!$F$9:$K$27,2,FALSE)>0,VLOOKUP(Database!$B7,'User Inputs'!$F$9:$K$27,2,FALSE),41%)","v":0.41},{"$f":"IF(VLOOKUP($B7,'User Inputs'!$F$9:$K$27,3,FALSE)>0,VLOOKUP(Database!$B7,'User Inputs'!$F$9:$K$27,3,FALSE),18%)","v":0.18},{"$f":"IF(VLOOKUP($B7,'User Inputs'!$F$9:$K$27,4,FALSE)>0,VLOOKUP(Database!$B7,'User Inputs'!$F$9:$K$27,4,FALSE),35%)","v":0.35},{"$f":"IF(VLOOKUP($B7,'User Inputs'!$F$9:$K$27,5,FALSE)>0,VLOOKUP(Database!$B7,'User Inputs'!$F$9:$K$27,5,FALSE),3%)","v":0.03},3.0000000000000027E-2,null,{"$f":"IF(AND(UserComeleclighting>0,CountryIndex=3),UserComeleclighting,22%)","v":0.22},{"$f":"IF(AND(UserIndeleclighting>0,CountryIndex=3),UserIndeleclighting,AVERAGE($J$11,$J$13,$J$14))","v":4.5400000000000003E-2},{"$f":"IF(AND(UserStreetconsumption>0,CountryIndex=3),UserStreetconsumption,1.4%)","v":1.3999999999999999E-2},7.26,null,null,null,null,null,null,"Halogen",50,50,80,9,9.4,9.4,9.4,9.4,9.4,9.4,9,9.4,9.4,{"$f":"250/365*97%","v":0.66438356164383561},{"$f":"340/365*90%","v":0.83835616438356164},1,null,null,"Indonesia",204567085,182683521.08212498,161419159.22816563,null,"CFL",8000]
[null,"Lao PDR",{"$f":"IF(VLOOKUP($B8,'User Inputs'!$F$9:$K$27,2,FALSE)>0,VLOOKUP(Database!$B8,'User Inputs'!$F$9:$K$27,2,FALSE),38%)","v":0.38},{"$f":"IF(VLOOKUP($B8,'User Inputs'!$F$9:$K$27,3,FALSE)>0,VLOOKUP(Database!$B8,'User Inputs'!$F$9:$K$27,3,FALSE),15%)","v":0.15},{"$f":"IF(VLOOKUP($B8,'User Inputs'!$F$9:$K$27,4,FALSE)>0,VLOOKUP(Database!$B8,'User Inputs'!$F$9:$K$27,4,FALSE),41%)","v":0.41},{"$f":"IF(VLOOKUP($B8,'User Inputs'!$F$9:$K$27,5,FALSE)>0,VLOOKUP(Database!$B8,'User Inputs'!$F$9:$K$27,5,FALSE),6%)","v":0.06},0,null,{"$f":"IF(AND(UserComeleclighting>0,CountryIndex=4),UserComeleclighting,20%)","v":0.2},{"$f":"IF(AND(UserIndeleclighting>0,CountryIndex=4),UserIndeleclighting,AVERAGE($J$11,$J$13,$J$14))","v":4.5400000000000003E-2},{"$f":"IF(AND(UserStreetconsumption>0,CountryIndex=4),UserStreetconsumption,0.3%)","v":3.0000000000000001E-3},{"$f":"IF(AND(UserLightpoint>0,CountryIndex=4),UserLightpoint,7.17)","v":7.17},null,null,null,null,null,null,"CFL",14,24,25,9.5,10.7,10.7,10.7,10.7,10.7,10.7,9.5,10.7,10.7,0.66438356164383561,{"$f":"340/365*90%","v":0.83835616438356164},1,null,null,"Lao PDR",1824472.4390541441,1612103.8471482417,1424454.9593401863,null,"LFL - T5",16000,null,"Lifetime and Ago_0"]
{"$rows_left_out":208}
{"sheet":"Policy Scenarios","index":6,"n_rows":512,"n_cols":48,"rows_kept":512,"cut":false,"hidden":false,"merged":[[106,44,106,47],[108,36,117,36],[1,41,1,42],[91,38,91,41],[57,17,57,18],[16,17,16,18],[36,17,36,18],[106,36,107,37],[106,38,106,41],[93,36,102,36],[3,20,3,23],[3,24,3,33],[3,34,3,36],[91,36,92,37],[502,0,511,0],[159,0,168,0],[139,13,139,14],[140,13,140,14],[157,0,158,1],[157,2,157,5],[157,9,157,12],[157,8,158,8],[500,0,501,1],[500,2,500,5]]}
[null,"Policy Scenarios",null,"Business As Usual (BAU)"]
[null,null,null,"Energy Efficiency",null,null,null,null,null,null,null,null,null,null,null,null,null,null,null,null,null,null,null,null,null,null,null,null,null,null,null,null,null,null,null,null,null,null,null,null,null,"Policy selection"]
[null,null,null,"Best Available Technologies",null,null,null,null,null,null,null,null,null,null,null,null,null,null,null,null,null,null,null,null,null,null,null,null,null,null,null,null,null,null,null,null,null,null,null,null,null,"MEPS for Ils",true]
[null,null,null,null,null,null,null,null,null,null,null,null,null,null,null,null,null,null,null,null,"Typical wattage",null,null,null,"Operating hours (default vaule by country)",null,null,null,null,null,null,null,null,null,"Utilisation (%)",null,null,null,null,null,null,"MEPS for CFLs",true]
[null,null,"CountryIndex:",null,5,null,null,null,null,null,null,null,null,null,null,null,null,null,null,null,"Lamp type","Commercial (W)","Industrial (W)","Outdoor (W)","BRN","KHM","IDN","LAO","MYS","MMR","PHL","SGP","THA","VNM","Commercial","Industrial","Outdoor",null,null,null,null,"MEPS for LFLs",true]
[null,null,null,null,null,null,null,null,null,null,null,null,null,null,null,null,null,null,null,null,"Incandescent",{"$f":"Database!T6","v":60},{"$f":"Database!U6","v":60},{"$f":"Database!V6","v":100},{"$f":"Database!W6","v":6.5},{"$f":"Database!X6","v":7.1},{"$f":"Database!Y6","v":7.1},{"$f":"Database!Z6","v":7.1},{"$f":"Database!AA6","v":7.1},{"$f":"Database!AB6","v":7.1},{"$f":"Database!AC6","v":7.1},{"$f":"Database!AD6","v":6.5},{"$f":"Database!AE6","v":7.1},{"$f":"Database!AF6","v":7.1},{"$f":"Database!AG6","v":0.66438356164383561},{"$f":"Database!AH6","v":0.83835616438356164},{"$f":"Database!AI6","v":1},null,null,null,null,"MEPS for HID",true]
[null,null,"EcoIndex:",null,1,null,null,null,null,null,null,null,null,null,null,null,null,null,null,null,"Halogen",{"$f":"Database!T7","v":50},{"$f":"Database!U7","v":50},{"$f":"Database!V7","v":80},{"$f":"Database!W7","v":9},{"$f":"Database!X7","v":9.4},{"$f":"Database!Y7","v":9.4},{"$f":"Database!Z7","v":9.4},{"$f":"Database!AA7","v":9.4},{"$f":"Database!AB7","v":9.4},{"$f":"Database!AC7","v":9.4},{"$f":"Database!AD7","v":9},{"$f":"Database!AE7","v":9.4},{"$f":"Database!AF7","v":9.4},{"$f":"Database!AG7","v":0.66438356164383561},{"$f":"Database!AH7","v":0.83835616438356164},{"$f":"Database!AI7","v":1},null,null,null,null,"Labelling programme for CFLs",true]
[null,null,null,null,15,null,null,null,null,null,null,null,null,null,null,null,null,null,null,null,"CFL",{"$f":"Database!T8","v":14},{"$f":"Database!U8","v":24},{"$f":"Database!V8","v":25},{"$f":"Database!W8","v":9.5},{"$f":"Database!X8","v":10.7},{"$f":"Database!Y8","v":10.7},{"$f":"Database!Z8","v":10.7},{"$f":"Database!AA8","v":10.7},{"$f":"Database!AB8","v":10.7},{"$f":"Database!AC8","v":10.7},{"$f":"Database!AD8","v":9.5},{"$f":"Database!AE8","v":10.7},{"$f":"Database!AF8","v":10.7},{"$f":"Database!AG8","v":0.66438356164383561},{"$f":"Database!AH8","v":0.83835616438356164},{"$f":"Database!AI8","v":1}]
{"$rows_left_out":505}
{"sheet":"Inputs & References","index":7,"n_rows":80,"n_cols":4,"rows_kept":80,"cut":false,"hidden":false,"merged":[[80,0,84,3],[60,0,60,3],[62,0,66,16383],[68,0,72,3],[74,0,78,3],[54,0,58,0],[27,0,32,0],[34,0,38,0],[40,0,42,0],[46,0,48,0],[50,0,52,0]]}
["POLICY ANALYSIS MODEL for ASEAN (PAMA)"]
[]
[]
[]
[]
[]
[]
[]
{"$rows_left_out":72}